zsh: command not found: npm
お気に入り
npm ERR! Error: EACCES: permission denied, mkdir '/usr/local/lib/node_modules'
npm ERR! code ERESOLVE
error astro@5.0.0: The engine "node" is incompatible with this module. Expected version ">=18.17.1". Got "16.20.0"
error: externally-managed-environment
zsh: command not found: python
Error: Cannot find module 'express'
Error: listen EADDRINUSE: address already in use :::3000
Error: Missing required environment variable: OPENAI_API_KEY
SyntaxError: Cannot use import statement outside a module
FATAL ERROR: Reached heap limit Allocation failed - JavaScript heap out of memory
このサイトにアクセスできません localhost で接続が拒否されました。
TypeError: Cannot read properties of undefined (reading 'map')
TypeError: data.map is not a function
ReferenceError: useState is not defined
SyntaxError: Unexpected token '<'
Error: Too many re-renders. React limits the number of renders to prevent an infinite loop.
Error: Hydration failed because the initial UI does not match what was rendered on the server.
Access to fetch at 'https://api.example.com' from origin 'http://localhost:3000' has been blocked by CORS policy
TypeError: Failed to fetch
401 Unauthorized
404 Not Found
500 Internal Server Error
429 Too Many Requests
Mixed Content: The page at 'https://example.com' was loaded over HTTPS, but requested an insecure resource 'http://api.example.com'.
Error: Command "npm run build" exited with 1
Type error: Type 'string | undefined' is not assignable to type 'string'.
404: NOT_FOUND
new row violates row-level security policy for table "posts"
FirebaseError: Missing or insufficient permissions.
Error 400: redirect_uri_mismatch
Error: connect ECONNREFUSED 127.0.0.1:5432
fatal: not a git repository (or any of the parent directories): .git
! [rejected] main -> main (fetch first)
CONFLICT (content): Merge conflict in src/App.jsx
remote: Support for password authentication was removed.
ModuleNotFoundError: No module named 'requests'
IndentationError: unexpected indent
KeyError: 'name'
npm ERR! code ENOENT
Error: ENOENT: no such file or directory, open 'data/users.json'
found 7 vulnerabilities (3 moderate, 4 high)
npm WARN deprecated inflight@1.0.6: This module is not supported, and leaks memory.
gyp ERR! build error
npm ERR! `npm ci` can only install packages when your package.json and package-lock.json are in sync.
Error: unable to get local issuer certificate
Uncaught (in promise) TypeError: Failed to fetch
TypeError: Assignment to constant variable.
RangeError: Maximum call stack size exceeded
Warning: Each child in a list should have a unique "key" prop.
Error: Objects are not valid as a React child (found: object with keys {id, name}).Error: Invalid hook call. Hooks can only be called inside of the body of a function component.
Warning: A component is changing an uncontrolled input to be controlled.
React Hook useEffect has a missing dependency: 'userId'. Either include it or remove the dependency array.
You're importing a component that needs useState. This React hook only works in a client component. To fix, mark the file (or its parent) with the "use client" directive.
Error: Element type is invalid: expected a string (for built-in components) or a class/function (for composite components) but got: undefined.
Error: Invalid src prop (https://images.example.com/a.jpg) on `next/image`, hostname "images.example.com" is not configured under images in your `next.config.js`
Module not found: Can't resolve 'fs'
ReferenceError: window is not defined
error TS2307: Cannot find module 'lodash' or its corresponding type declarations.
error TS18048: 'user' is possibly 'undefined'.
net::ERR_BLOCKED_BY_CLIENT
GET http://localhost:3000/favicon.ico 404 (Not Found)
Failed to load module script: Expected a JavaScript module script but the server responded with a MIME type of "text/html".
Refused to load the script 'https://example.com/a.js' because it violates the following Content Security Policy directive: "script-src 'self'".
405 Method Not Allowed
400 Bad Request
413 Payload Too Large
ResizeObserver loop completed with undelivered notifications.
NotAllowedError: play() failed because the user didn't interact with the document first.
NotAllowedError: Permission denied
504: GATEWAY_TIMEOUT
Error: A Serverless Function has exceeded the unzipped maximum size of 250 MB.
✘ [ERROR] Authentication error [code: 10000]
Error 1101 Worker threw exception
Error: No Output Directory named "dist" found after the Build completed.
DNS_PROBE_FINISHED_NXDOMAIN
NET::ERR_CERT_COMMON_NAME_INVALID
AuthApiError: Invalid login credentials
AuthApiError: Email not confirmed
JWT expired
duplicate key value violates unique constraint "users_email_key"
relation "public.posts" does not exist
null value in column "title" of relation "posts" violates not-null constraint
StripeSignatureVerificationError: No signatures found matching the expected signature for payload.
FirebaseError: Firebase: Error (auth/invalid-api-key).
*** Please tell me who you are.
error: src refspec main does not match any
error: Your local changes to the following files would be overwritten by merge:
error: remote origin already exists.
remote: error: File video.mp4 is 120.00 MB; this exceeds GitHub's file size limit of 100.00 MB
fatal: refusing to merge unrelated histories
SyntaxError: invalid syntax
TypeError: can only concatenate str (not "int") to str
UnicodeDecodeError: 'utf-8' codec can't decode byte 0x82 in position 0: invalid start byte
FileNotFoundError: [Errno 2] No such file or directory: 'data.csv'
AttributeError: 'NoneType' object has no attribute 'text'
ValueError: invalid literal for int() with base 10: '1,200'
StorageApiError: new row violates row-level security policy
An invalid form control with name='' is not focusable.